{"text_format":"1","workbook":"xlsx","n_sheets":7,"sheets":["Danh mục BM20","A.GVCH","B.Thông tin GV chi tiết","C.Quydoi","DSDonvi","Khoi-Nganh","ListDLnhap"],"not_rendered":{"charts":0,"images":3,"macros":1,"external_links":0,"defined_names":11,"comments":0,"pivot_tables":0},"unopened":[],"bounds":{"document_bytes":16777216,"sheet_cells":100000,"rows_first":2000,"rows_last":500,"rows_between":2000,"halvings":0,"cell_chars":16384,"cell_head_chars":4096},"cells_cut":0,"cells_raw":0,"read":"whole","date_system":"1900"}

{"sheet":"Danh mục BM20","index":0,"n_rows":7,"n_cols":5,"rows_kept":7,"cut":false,"hidden":false,"merged":[[0,0,0,4],[1,0,1,4]]}
["DANH MỤC CÁC MẪU BÁO CÁO TRONG BIỂU MẪU 20"]
["CÔNG KHAI THÔNG TIN VỀ ĐỘI NGŨ GIẢNG VIÊN CƠ HỮU CỦA CƠ SỞ GIÁO DỤC ĐẠI HỌC"]
[null,"Năm học 2019 - 2020"]
["STT","Tên mẫu báo cáo","Tên sheet","Đơn vị báo cáo","Ghi chú"]
[1,"A. Công khai thông tin về đội ngũ giảng viên cơ hữu","A.GVCH","Các Khoa","1. Click chọn tên Khoa ở ô C3 của Sheet;\n2. Chuyển sang Sheet B để nhập dữ liệu;\n3. Dữ liệu sẽ được cập nhật tự động từ Sheet \"B. Thông tin GV chi tiết\" (Thầy/Cô vui lòng kiểm tra lại, nếu có sai sót thì phản hồi ngay đến TT. QLCL để kịp thời điều chỉnh)"]
[2,"B. Công khai thông tin về danh sách chi tiết đội ngũ giảng viên cơ hữu theo khối ngành","B.Thông tin GV chi tiết","Các Khoa","1. Click chọn tên Khoa ở ô C3 của Sheet và nhập dữ liệu vào các ô tương ứng (không có dữ liệu thì để trống). \n2. Nhập thông tin của từng GV\n3. Ý nghĩa của các màu:\n Dòng dữ liệu nhập đúng định dạng không có các màu sau:\n - Cột Mã số CBVC, nếu ô có màu đỏ -> cảnh báo chưa nhập Mã số cho GV đó;\n - 03 dãy ô có màu vàng -> mỗi dãy cần ít nhất 1 dấu x; Nếu nhập nhầm (khác x) thì ô đó sẽ có màu đỏ hoặc báo lỗi yêu cầu nhập lại."]
[3,"C. Công khai tỷ lệ sinh viên/giảng viên quy đổi","C.Quydoi","TT QLCL"]

{"sheet":"A.GVCH","index":1,"n_rows":68,"n_cols":15,"rows_kept":68,"cut":false,"hidden":false,"merged":[[3,11,3,13],[0,0,0,13],[3,0,4,0],[3,2,4,2],[3,3,4,3],[1,0,1,6],[3,4,3,5],[3,6,3,10],[3,1,4,1],[2,2,2,3]]}
[{"$f":"\"CÔNG KHAI THÔNG TIN VỀ ĐỘI NGŨ GIẢNG VIÊN CƠ HỮU CỦA CƠ SỞ GIÁO DỤC ĐẠI HỌC\n\"&'Danh mục BM20'!B3","v":"CÔNG KHAI THÔNG TIN VỀ ĐỘI NGŨ GIẢNG VIÊN CƠ HỮU CỦA CƠ SỞ GIÁO DỤC ĐẠI HỌC\nNăm học 2019 - 2020"}]
["A. Công khai thông tin về đội ngũ giảng viên cơ hữu"]
[null,null,"Khoa Công nghệ Cơ khí"]
["Khối ngành","Mã ngành","Nội dung","Tổng Số","Chức danh",null,"Trình độ đào tạo",null,null,null,null,"Hạng chức danh nghề nghiệp"]
[null,null,null,null,"Giáo sư","Phó Giáo sư","Tiến sĩ","Thạc sĩ","Đại học","Cao đẳng","Trình độ khác","Hạng III","Hạng II","Hạng I"]
["I",null,"Tổng số"]
["1",null,"Giảng viên cơ hữu theo ngành",null,null,null,null,null,null,null,null,null,null,null,"Đơn vị"]
[3,null,"Khối ngành III"]
["III","Column1","Trình độ ĐHCQ","Column2","Column3","Column4","Column5","Column6","Column7","Column8","Column9","Column10","Column11","Column12","Column13"]
["III",7340301,"Ngành Kế toán-ĐHCQ",{"$f":"IF(SUM(E10:K10)<>SUM(L10:N10), \"ChucDanh + TrinhDoDT = HangChucDanhNN\",SUM(E10:K10))","v":14},{"$f":"COUNTIFS('B.Thông tin GV chi tiết'!$G$7:$G$763,\"x\",'B.Thông tin GV chi tiết'!M$7:M$763,\"x\")","v":0},{"$f":"COUNTIFS('B.Thông tin GV chi tiết'!$G$7:$G$763,\"x\",'B.Thông tin GV chi tiết'!N$7:N$763,\"x\")","v":1},{"$f":"COUNTIFS('B.Thông tin GV chi tiết'!$G$7:$G$763,\"x\",'B.Thông tin GV chi tiết'!O$7:O$763,\"x\")","v":2},{"$f":"COUNTIFS('B.Thông tin GV chi tiết'!$G$7:$G$763,\"x\",'B.Thông tin GV chi tiết'!P$7:P$763,\"x\")","v":10},{"$f":"COUNTIFS('B.Thông tin GV chi tiết'!$G$7:$G$763,\"x\",'B.Thông tin GV chi tiết'!Q$7:Q$763,\"x\")","v":1},{"$f":"COUNTIFS('B.Thông tin GV chi tiết'!$G$7:$G$763,\"x\",'B.Thông tin GV chi tiết'!R$7:R$763,\"x\")","v":0},{"$f":"COUNTIFS('B.Thông tin GV chi tiết'!$G$7:$G$763,\"x\",'B.Thông tin GV chi tiết'!S$7:S$763,\"x\")","v":0},{"$f":"COUNTIFS('B.Thông tin GV chi tiết'!$G$7:$G$763,\"x\",'B.Thông tin GV chi tiết'!U$7:U$763,\"x\")","v":13},{"$f":"COUNTIFS('B.Thông tin GV chi tiết'!$G$7:$G$763,\"x\",'B.Thông tin GV chi tiết'!V$7:V$763,\"x\")","v":0},{"$f":"COUNTIFS('B.Thông tin GV chi tiết'!$G$7:$G$763,\"x\",'B.Thông tin GV chi tiết'!W$7:W$763,\"x\")","v":1},"Khoa Tài chính Kế toán"]
["III",7340201,"Ngành Tài chính ngân hàng_ĐHCQ",{"$f":"IF(SUM(E11:K11)<>SUM(L11:N11), \"ChucDanh + TrinhDoDT = HangChucDanhNN\",SUM(E11:K11))","v":8},{"$f":"COUNTIFS('B.Thông tin GV chi tiết'!$H$7:$H$763,\"x\",'B.Thông tin GV chi tiết'!M$7:M$763,\"x\")","v":0},{"$f":"COUNTIFS('B.Thông tin GV chi tiết'!$H$7:$H$763,\"x\",'B.Thông tin GV chi tiết'!N$7:N$763,\"x\")","v":0},{"$f":"COUNTIFS('B.Thông tin GV chi tiết'!$H$7:$H$763,\"x\",'B.Thông tin GV chi tiết'!O$7:O$763,\"x\")","v":3},{"$f":"COUNTIFS('B.Thông tin GV chi tiết'!$H$7:$H$763,\"x\",'B.Thông tin GV chi tiết'!P$7:P$763,\"x\")","v":5},{"$f":"COUNTIFS('B.Thông tin GV chi tiết'!$H$7:$H$763,\"x\",'B.Thông tin GV chi tiết'!Q$7:Q$763,\"x\")","v":0},{"$f":"COUNTIFS('B.Thông tin GV chi tiết'!$H$7:$H$763,\"x\",'B.Thông tin GV chi tiết'!R$7:R$763,\"x\")","v":0},{"$f":"COUNTIFS('B.Thông tin GV chi tiết'!$H$7:$H$763,\"x\",'B.Thông tin GV chi tiết'!S$7:S$763,\"x\")","v":0},{"$f":"COUNTIFS('B.Thông tin GV chi tiết'!$H$7:$H$763,\"x\",'B.Thông tin GV chi tiết'!U$7:U$763,\"x\")","v":8},{"$f":"COUNTIFS('B.Thông tin GV chi tiết'!$H$7:$H$763,\"x\",'B.Thông tin GV chi tiết'!V$7:V$763,\"x\")","v":0},{"$f":"COUNTIFS('B.Thông tin GV chi tiết'!$H$7:$H$763,\"x\",'B.Thông tin GV chi tiết'!W$7:W$763,\"x\")","v":0},"Khoa Tài chính Kế toán"]
["III",7340101,"Ngành Quản trị kinh doanh_ĐHCQ",14,{"$f":"COUNTIFS('B.Thông tin GV chi tiết'!$G$7:$G$763,\"x\",'B.Thông tin GV chi tiết'!M$7:M$763,\"x\")","v":0},{"$f":"COUNTIFS('B.Thông tin GV chi tiết'!$G$7:$G$763,\"x\",'B.Thông tin GV chi tiết'!N$7:N$763,\"x\")","v":1},{"$f":"COUNTIFS('B.Thông tin GV chi tiết'!$G$7:$G$763,\"x\",'B.Thông tin GV chi tiết'!O$7:O$763,\"x\")","v":2},{"$f":"COUNTIFS('B.Thông tin GV chi tiết'!$G$7:$G$763,\"x\",'B.Thông tin GV chi tiết'!P$7:P$763,\"x\")","v":10},{"$f":"COUNTIFS('B.Thông tin GV chi tiết'!$G$7:$G$763,\"x\",'B.Thông tin GV chi tiết'!Q$7:Q$763,\"x\")","v":1},{"$f":"COUNTIFS('B.Thông tin GV chi tiết'!$G$7:$G$763,\"x\",'B.Thông tin GV chi tiết'!R$7:R$763,\"x\")","v":0},{"$f":"COUNTIFS('B.Thông tin GV chi tiết'!$G$7:$G$763,\"x\",'B.Thông tin GV chi tiết'!S$7:S$763,\"x\")","v":0},{"$f":"COUNTIFS('B.Thông tin GV chi tiết'!$G$7:$G$763,\"x\",'B.Thông tin GV chi tiết'!U$7:U$763,\"x\")","v":13},{"$f":"COUNTIFS('B.Thông tin GV chi tiết'!$G$7:$G$763,\"x\",'B.Thông tin GV chi tiết'!V$7:V$763,\"x\")","v":0},{"$f":"COUNTIFS('B.Thông tin GV chi tiết'!$G$7:$G$763,\"x\",'B.Thông tin GV chi tiết'!W$7:W$763,\"x\")","v":1},"Khoa Quản trị kinh doanh"]
["III",7380107,"Ngành Luật kinh tế_ĐHCQ",14,{"$f":"COUNTIFS('B.Thông tin GV chi tiết'!$G$7:$G$763,\"x\",'B.Thông tin GV chi tiết'!M$7:M$763,\"x\")","v":0},{"$f":"COUNTIFS('B.Thông tin GV chi tiết'!$G$7:$G$763,\"x\",'B.Thông tin GV chi tiết'!N$7:N$763,\"x\")","v":1},{"$f":"COUNTIFS('B.Thông tin GV chi tiết'!$G$7:$G$763,\"x\",'B.Thông tin GV chi tiết'!O$7:O$763,\"x\")","v":2},{"$f":"COUNTIFS('B.Thông tin GV chi tiết'!$G$7:$G$763,\"x\",'B.Thông tin GV chi tiết'!P$7:P$763,\"x\")","v":10},{"$f":"COUNTIFS('B.Thông tin GV chi tiết'!$G$7:$G$763,\"x\",'B.Thông tin GV chi tiết'!Q$7:Q$763,\"x\")","v":1},{"$f":"COUNTIFS('B.Thông tin GV chi tiết'!$G$7:$G$763,\"x\",'B.Thông tin GV chi tiết'!R$7:R$763,\"x\")","v":0},{"$f":"COUNTIFS('B.Thông tin GV chi tiết'!$G$7:$G$763,\"x\",'B.Thông tin GV chi tiết'!S$7:S$763,\"x\")","v":0},{"$f":"COUNTIFS('B.Thông tin GV chi tiết'!$G$7:$G$763,\"x\",'B.Thông tin GV chi tiết'!U$7:U$763,\"x\")","v":13},{"$f":"COUNTIFS('B.Thông tin GV chi tiết'!$G$7:$G$763,\"x\",'B.Thông tin GV chi tiết'!V$7:V$763,\"x\")","v":0},{"$f":"COUNTIFS('B.Thông tin GV chi tiết'!$G$7:$G$763,\"x\",'B.Thông tin GV chi tiết'!W$7:W$763,\"x\")","v":1},"Khoa Chính trị - Luật"]
["III",7340120,"Ngành Kinh doanh quốc tế_ĐHCQ",8,{"$f":"COUNTIFS('B.Thông tin GV chi tiết'!$H$7:$H$763,\"x\",'B.Thông tin GV chi tiết'!M$7:M$763,\"x\")","v":0},{"$f":"COUNTIFS('B.Thông tin GV chi tiết'!$H$7:$H$763,\"x\",'B.Thông tin GV chi tiết'!N$7:N$763,\"x\")","v":0},{"$f":"COUNTIFS('B.Thông tin GV chi tiết'!$H$7:$H$763,\"x\",'B.Thông tin GV chi tiết'!O$7:O$763,\"x\")","v":3},{"$f":"COUNTIFS('B.Thông tin GV chi tiết'!$H$7:$H$763,\"x\",'B.Thông tin GV chi tiết'!P$7:P$763,\"x\")","v":5},{"$f":"COUNTIFS('B.Thông tin GV chi tiết'!$H$7:$H$763,\"x\",'B.Thông tin GV chi tiết'!Q$7:Q$763,\"x\")","v":0},{"$f":"COUNTIFS('B.Thông tin GV chi tiết'!$H$7:$H$763,\"x\",'B.Thông tin GV chi tiết'!R$7:R$763,\"x\")","v":0},{"$f":"COUNTIFS('B.Thông tin GV chi tiết'!$H$7:$H$763,\"x\",'B.Thông tin GV chi tiết'!S$7:S$763,\"x\")","v":0},{"$f":"COUNTIFS('B.Thông tin GV chi tiết'!$H$7:$H$763,\"x\",'B.Thông tin GV chi tiết'!U$7:U$763,\"x\")","v":8},{"$f":"COUNTIFS('B.Thông tin GV chi tiết'!$H$7:$H$763,\"x\",'B.Thông tin GV chi tiết'!V$7:V$763,\"x\")","v":0},{"$f":"COUNTIFS('B.Thông tin GV chi tiết'!$H$7:$H$763,\"x\",'B.Thông tin GV chi tiết'!W$7:W$763,\"x\")","v":0},"Khoa Quản trị kinh doanh"]
["III",null,"Trình độ ĐHLT",0]
["III",null,"Ngành Kế toán_ĐHLT",0,null,null,null,null,null,null,null,null,null,null,"Khoa Tài chính Kế toán"]
["III",null,"Ngành Tài chính - Ngân hàng_ĐHLT",0,null,null,null,null,null,null,null,null,null,null,"Khoa Tài chính Kế toán"]
["III",null,"Ngành Quản trị kinh doanh_ĐHLT",0,null,null,null,null,null,null,null,null,null,null,"Khoa Quản trị kinh doanh"]
["III",null,"Trình độ Thạc sỹ",0]
["III",null,"Ngành Quản trị kinh doanh_ThS",6,{"$f":"COUNTIFS('B.Thông tin GV chi tiết'!$I$7:$I$763,\"x\",'B.Thông tin GV chi tiết'!M$7:M$763,\"x\")","v":0},{"$f":"COUNTIFS('B.Thông tin GV chi tiết'!$I$7:$I$763,\"x\",'B.Thông tin GV chi tiết'!N$7:N$763,\"x\")","v":1},{"$f":"COUNTIFS('B.Thông tin GV chi tiết'!$I$7:$I$763,\"x\",'B.Thông tin GV chi tiết'!O$7:O$763,\"x\")","v":5},{"$f":"COUNTIFS('B.Thông tin GV chi tiết'!$I$7:$I$763,\"x\",'B.Thông tin GV chi tiết'!P$7:P$763,\"x\")","v":0},{"$f":"COUNTIFS('B.Thông tin GV chi tiết'!$I$7:$I$763,\"x\",'B.Thông tin GV chi tiết'!Q$7:Q$763,\"x\")","v":0},{"$f":"COUNTIFS('B.Thông tin GV chi tiết'!$I$7:$I$763,\"x\",'B.Thông tin GV chi tiết'!R$7:R$763,\"x\")","v":0},{"$f":"COUNTIFS('B.Thông tin GV chi tiết'!$I$7:$I$763,\"x\",'B.Thông tin GV chi tiết'!S$7:S$763,\"x\")","v":0},{"$f":"COUNTIFS('B.Thông tin GV chi tiết'!$I$7:$I$763,\"x\",'B.Thông tin GV chi tiết'!U$7:U$763,\"x\")","v":5},{"$f":"COUNTIFS('B.Thông tin GV chi tiết'!$I$7:$I$763,\"x\",'B.Thông tin GV chi tiết'!V$7:V$763,\"x\")","v":0},{"$f":"COUNTIFS('B.Thông tin GV chi tiết'!$I$7:$I$763,\"x\",'B.Thông tin GV chi tiết'!W$7:W$763,\"x\")","v":1},"Khoa Quản trị kinh doanh"]
["III",null,"Ngành Tài chính ngân hàng_ThS",6,{"$f":"COUNTIFS('B.Thông tin GV chi tiết'!$I$7:$I$763,\"x\",'B.Thông tin GV chi tiết'!M$7:M$763,\"x\")","v":0},{"$f":"COUNTIFS('B.Thông tin GV chi tiết'!$I$7:$I$763,\"x\",'B.Thông tin GV chi tiết'!N$7:N$763,\"x\")","v":1},{"$f":"COUNTIFS('B.Thông tin GV chi tiết'!$I$7:$I$763,\"x\",'B.Thông tin GV chi tiết'!O$7:O$763,\"x\")","v":5},{"$f":"COUNTIFS('B.Thông tin GV chi tiết'!$I$7:$I$763,\"x\",'B.Thông tin GV chi tiết'!P$7:P$763,\"x\")","v":0},{"$f":"COUNTIFS('B.Thông tin GV chi tiết'!$I$7:$I$763,\"x\",'B.Thông tin GV chi tiết'!Q$7:Q$763,\"x\")","v":0},{"$f":"COUNTIFS('B.Thông tin GV chi tiết'!$I$7:$I$763,\"x\",'B.Thông tin GV chi tiết'!R$7:R$763,\"x\")","v":0},{"$f":"COUNTIFS('B.Thông tin GV chi tiết'!$I$7:$I$763,\"x\",'B.Thông tin GV chi tiết'!S$7:S$763,\"x\")","v":0},{"$f":"COUNTIFS('B.Thông tin GV chi tiết'!$I$7:$I$763,\"x\",'B.Thông tin GV chi tiết'!U$7:U$763,\"x\")","v":5},{"$f":"COUNTIFS('B.Thông tin GV chi tiết'!$I$7:$I$763,\"x\",'B.Thông tin GV chi tiết'!V$7:V$763,\"x\")","v":0},{"$f":"COUNTIFS('B.Thông tin GV chi tiết'!$I$7:$I$763,\"x\",'B.Thông tin GV chi tiết'!W$7:W$763,\"x\")","v":1},"Khoa Tài chính Kế toán"]
[4,null,"Khối ngành IV",0]
["IV",null,"Trình độ ĐHCQ",0]
["IV",7420201,"Ngành Công nghệ Sinh học_ĐHCQ",14,{"$f":"COUNTIFS('B.Thông tin GV chi tiết'!$G$7:$G$763,\"x\",'B.Thông tin GV chi tiết'!M$7:M$763,\"x\")","v":0},{"$f":"COUNTIFS('B.Thông tin GV chi tiết'!$G$7:$G$763,\"x\",'B.Thông tin GV chi tiết'!N$7:N$763,\"x\")","v":1},{"$f":"COUNTIFS('B.Thông tin GV chi tiết'!$G$7:$G$763,\"x\",'B.Thông tin GV chi tiết'!O$7:O$763,\"x\")","v":2},{"$f":"COUNTIFS('B.Thông tin GV chi tiết'!$G$7:$G$763,\"x\",'B.Thông tin GV chi tiết'!P$7:P$763,\"x\")","v":10},{"$f":"COUNTIFS('B.Thông tin GV chi tiết'!$G$7:$G$763,\"x\",'B.Thông tin GV chi tiết'!Q$7:Q$763,\"x\")","v":1},{"$f":"COUNTIFS('B.Thông tin GV chi tiết'!$G$7:$G$763,\"x\",'B.Thông tin GV chi tiết'!R$7:R$763,\"x\")","v":0},{"$f":"COUNTIFS('B.Thông tin GV chi tiết'!$G$7:$G$763,\"x\",'B.Thông tin GV chi tiết'!S$7:S$763,\"x\")","v":0},{"$f":"COUNTIFS('B.Thông tin GV chi tiết'!$G$7:$G$763,\"x\",'B.Thông tin GV chi tiết'!U$7:U$763,\"x\")","v":13},{"$f":"COUNTIFS('B.Thông tin GV chi tiết'!$G$7:$G$763,\"x\",'B.Thông tin GV chi tiết'!V$7:V$763,\"x\")","v":0},{"$f":"COUNTIFS('B.Thông tin GV chi tiết'!$G$7:$G$763,\"x\",'B.Thông tin GV chi tiết'!W$7:W$763,\"x\")","v":1},"Khoa Công nghệ Sinh học"]
["IV",null,"Trình độ ĐHLT",0]
["IV",null,"Ngành Công nghệ sinh họcĐHLT",0,null,null,null,null,null,null,null,null,null,null,"Khoa Công nghệ Sinh học"]
["IV",null,"Trình độ Thạc sỹ",0]
["IV",null,"Ngành Công nghệ sinh học_ThS",8,{"$f":"COUNTIFS('B.Thông tin GV chi tiết'!$H$7:$H$763,\"x\",'B.Thông tin GV chi tiết'!M$7:M$763,\"x\")","v":0},{"$f":"COUNTIFS('B.Thông tin GV chi tiết'!$H$7:$H$763,\"x\",'B.Thông tin GV chi tiết'!N$7:N$763,\"x\")","v":0},{"$f":"COUNTIFS('B.Thông tin GV chi tiết'!$H$7:$H$763,\"x\",'B.Thông tin GV chi tiết'!O$7:O$763,\"x\")","v":3},{"$f":"COUNTIFS('B.Thông tin GV chi tiết'!$H$7:$H$763,\"x\",'B.Thông tin GV chi tiết'!P$7:P$763,\"x\")","v":5},{"$f":"COUNTIFS('B.Thông tin GV chi tiết'!$H$7:$H$763,\"x\",'B.Thông tin GV chi tiết'!Q$7:Q$763,\"x\")","v":0},{"$f":"COUNTIFS('B.Thông tin GV chi tiết'!$H$7:$H$763,\"x\",'B.Thông tin GV chi tiết'!R$7:R$763,\"x\")","v":0},{"$f":"COUNTIFS('B.Thông tin GV chi tiết'!$H$7:$H$763,\"x\",'B.Thông tin GV chi tiết'!S$7:S$763,\"x\")","v":0},{"$f":"COUNTIFS('B.Thông tin GV chi tiết'!$H$7:$H$763,\"x\",'B.Thông tin GV chi tiết'!U$7:U$763,\"x\")","v":8},{"$f":"COUNTIFS('B.Thông tin GV chi tiết'!$H$7:$H$763,\"x\",'B.Thông tin GV chi tiết'!V$7:V$763,\"x\")","v":0},{"$f":"COUNTIFS('B.Thông tin GV chi tiết'!$H$7:$H$763,\"x\",'B.Thông tin GV chi tiết'!W$7:W$763,\"x\")","v":0},"Khoa Công nghệ Sinh học"]
[5,null,"Khối ngành V",0]
["V",null,"Trình độ ĐHCQ",0]
{"$rows_left_out":39}
{"sheet":"B.Thông tin GV chi tiết","index":2,"n_rows":28,"n_cols":23,"rows_kept":28,"cut":false,"hidden":false,"merged":[[5,0,5,3],[0,0,0,22],[1,0,1,22],[3,12,3,13],[3,14,3,18],[3,20,3,22],[3,0,4,0],[3,10,4,10],[3,11,4,11],[3,19,4,19],[3,1,4,1],[3,4,3,5],[3,6,3,9],[3,2,4,3],[2,2,2,6]]}
[{"$f":"\"CÔNG KHAI THÔNG TIN VỀ ĐỘI NGŨ GIẢNG VIÊN CƠ HỮU CỦA CƠ SỞ GIÁO DỤC ĐẠI HỌC\n\"&'Danh mục BM20'!B3","v":"CÔNG KHAI THÔNG TIN VỀ ĐỘI NGŨ GIẢNG VIÊN CƠ HỮU CỦA CƠ SỞ GIÁO DỤC ĐẠI HỌC\nNăm học 2019 - 2020"}]
["B. Công khai thông tin về danh sách chi tiết đội ngũ giảng viên cơ hữu theo khối ngành"]
[null,null,"Khoa Công nghệ Cơ khí"]
["STT","Mã số CBVC","Họ và tên",null,"Khối ngành\n(Đánh x)",null,"Tên ngành\n(Đánh dấu x)",null,null,null,"Năm sinh","Giới tính\n(Nhập Nam hoặc Nữ)","Chức danh\n(Đánh dấu x)",null,"Trình độ đào tạo\n(Đánh dấu x)",null,null,null,null,"Chuyên ngành giảng dạy","Hạng chức danh nghề nghiệp (Đánh dấu x)"]
[null,null,null,null,{"$f":"IFERROR(VLOOKUP($C$3,DSDonvi!$A$2:$G$15,DSDonvi!B$16,0),\"\")","v":"V"},{"$f":"IFERROR(VLOOKUP($C$3,DSDonvi!$A$2:$G$15,DSDonvi!C$16,0),\"\")","v":0},{"$f":"IFERROR(VLOOKUP($C$3,DSDonvi!$A$2:$G$15,DSDonvi!D$16,0),\"\")","v":"Ngành Công nghệ chế tạo máy_ĐHCQ"},{"$f":"IFERROR(VLOOKUP($C$3,DSDonvi!$A$2:$G$15,DSDonvi!E$16,0),\"\")","v":"Ngành Công nghệ kỹ thuật cơ điện tử_ĐHCQ"},{"$f":"IFERROR(VLOOKUP($C$3,DSDonvi!$A$2:$G$15,DSDonvi!F$16,0),\"\")","v":"Ngành Kỹ thuật Cơ khí_ThS"},{"$f":"IFERROR(VLOOKUP($C$3,DSDonvi!$A$2:$G$15,DSDonvi!G$16,0),\"\")","v":0},null,null,"Giáo sư","Phó Giáo sư","Tiến sĩ","Thạc sĩ","Đại học","Cao đẳng","Trình độ khác",null,"Hạng III","Hạng II","Hạng I"]
["Tổng cộng",null,null,null,{"$f":"COUNTIF(E7:E763,\"x\")","v":22},0,14,8,6,0,null,null,{"$f":"COUNTIF(M7:M763,\"x\")","v":0},1,5,15,1,0,0,null,{"$f":"COUNTIF(U7:U763,\"x\")","v":21},{"$f":"COUNTIF(V7:V763,\"x\")","v":0},{"$f":"COUNTIF(W7:W763,\"x\")","v":1}]
[1,"01003029","Nguyễn Ngọc","Dũng","x",null,"x",null,"x",null,1980,"Nam",null,"x",null,null,null,null,null,"Công nghệ Chế tạo máy",null,null,"x"]
[2,"01003028","Nguyễn Vũ Anh","Duy","x",null,null,"x","x",null,1984,"Nam",null,null,"x",null,null,null,null,"Công nghệ Chế tạo máy","x"]
[3,"01003007","Đặng Văn","Hải","x",null,"x",null,null,null,1970,"Nam",null,null,null,"x",null,null,null,"Công nghệ Chế tạo máy","x"]
[4,"01003008","Võ Kim","Hằng","x",null,"x",null,null,null,1980,"Nữ",null,null,null,"x",null,null,null,"Công nghệ Chế tạo máy","x"]
[5,"01003009","Nguyễn Thị Út","Hiền","x",null,"x",null,null,null,1983,"Nữ",null,null,null,"x",null,null,null,"Công nghệ Chế tạo máy","x"]
[6,"01003014","Hoàng Trọng Trần","Huy","x",null,"x",null,null,null,1978,"Nam",null,null,null,"x",null,null,null,"Công nghệ Chế tạo máy","x"]
[7,"01003012","Nguyễn Minh","Huy","x",null,"x",null,null,null,1981,"Nam",null,null,null,"x",null,null,null,"Công nghệ Chế tạo máy","x"]
[8,"01003013","Trần Quang","Huy","x",null,null,"x",null,null,1984,"Nam",null,null,null,"x",null,null,null,"Công nghệ Chế tạo máy","x"]
[9,"01003015","Nguyễn Tấn","Ken","x",null,null,"x",null,null,1987,"Nam",null,null,null,"x",null,null,null,"Công nghệ Chế tạo máy","x"]
[10,"01003016","Đinh Lê Cao","Kỳ","x",null,null,"x",null,null,1984,"Nam",null,null,null,"x",null,null,null,"Công nghệ Chế tạo máy","x"]
[11,"01003024","Phạm Hữu","Lộc","x",null,"x",null,"x",null,1980,"Nam",null,null,"x",null,null,null,null,"Công nghệ Chế tạo máy","x"]
[12,"01003018","Huỳnh Văn","Nam","x",null,"x",null,null,null,1977,"Nam",null,null,null,"x",null,null,null,"Công nghệ Chế tạo máy","x"]
[13,"01012021","Lê Văn","Nam","x",null,null,"x",null,null,1984,"Nam",null,null,null,"x",null,null,null,"Công nghệ Chế tạo máy","x"]
[14,"01003019","Trần Quốc","Nhiệm","x",null,"x",null,null,null,1978,"Nam",null,null,null,"x",null,null,null,"Công nghệ Chế tạo máy","x"]
[15,"01003020","Hồ Thị Mỹ","Nữ","x",null,"x",null,null,null,1982,"Nữ",null,null,null,"x",null,null,null,"Công nghệ Chế tạo máy","x"]
[16,"01003001","Phan Hoàng","Phụng","x",null,"x",null,null,null,1981,"Nam",null,null,null,"x",null,null,null,"Công nghệ Chế tạo máy","x"]
[17,"01002021","Nguyễn Lê","Thái","x",null,null,"x","x",null,1980,"Nam",null,null,"x",null,null,null,null,"Công nghệ Chế tạo máy","x"]
[18,"01003027","Nguyễn Hữu","Thọ","x",null,null,"x","x",null,1985,"Nam",null,null,"x",null,null,null,null,"Công nghệ Chế tạo máy","x"]
[19,"01003002","Trịnh Tiến","Thọ","x",null,"x",null,null,null,1978,"Nam",null,null,null,"x",null,null,null,"Công nghệ Chế tạo máy","x"]
[20,"01003003","Phạm Văn","Toàn","x",null,null,"x",null,null,1986,"Nam",null,null,null,"x",null,null,null,"Công nghệ Chế tạo máy","x"]
[21,"01003025","Lê Thể","Truyền","x",null,"x",null,"x",null,1970,"Nam",null,null,"x",null,null,null,null,"Công nghệ Chế tạo máy","x"]
[22,"01003005","Phạm Thanh","Vương","x",null,"x",null,null,null,1979,"Nam",null,null,null,null,"x",null,null,"Công nghệ Chế tạo máy","x"]

{"sheet":"C.Quydoi","index":3,"n_rows":11,"n_cols":3,"rows_kept":11,"cut":false,"hidden":false,"merged":[[0,0,0,2],[1,0,1,2]]}
[{"$f":"\"CÔNG KHAI THÔNG TIN VỀ ĐỘI NGŨ GIẢNG VIÊN CƠ HỮU CỦA CƠ SỞ GIÁO DỤC ĐẠI HỌC\n\"&'Danh mục BM20'!B3","v":"CÔNG KHAI THÔNG TIN VỀ ĐỘI NGŨ GIẢNG VIÊN CƠ HỮU CỦA CƠ SỞ GIÁO DỤC ĐẠI HỌC\nNăm học 2019 - 2020"}]
["C. Công khai tỷ lệ sinh viên/giảng viên quy đổi"]
[]
["II","Khối ngành","Tỷ lệ Sinh viên/Giảng viên cơ hữu quy đổi"]
[1,"Khối ngành I"]
[2,"Khối ngành II"]
[3,"Khối ngành III"]
[4,"Khối ngành IV"]
[5,"Khối ngành V"]
[6,"Khối ngành VI"]
[7,"Khối ngành VII"]

{"sheet":"DSDonvi","index":4,"n_rows":16,"n_cols":7,"rows_kept":16,"cut":false,"hidden":true,"merged":[[0,1,0,2],[0,3,0,5]]}
["Hãy Click chọn tên Khoa","Khối ngành",null,"Tên ngành"]
["Khoa Chính trị - Luật","III",null,"Ngành Luật kinh tế_ĐHCQ"]
["Khoa Công nghệ Cơ khí","V",null,"Ngành Công nghệ chế tạo máy_ĐHCQ","Ngành Công nghệ kỹ thuật cơ điện tử_ĐHCQ","Ngành Kỹ thuật Cơ khí_ThS"]
["Khoa Công nghệ Điện - Điện tử","V",null,"Ngành Công nghệ kỹ thuật điện - điện tử_ĐHCQ","Ngành Công nghệ kỹ thuật điều khiển và tự động hóa_ĐHCQ","Ngành Kỹ thuật Điện_ThS"]
["Khoa Công nghệ Hóa học","V",null,"Ngành Công nghệ kỹ thuật hoá học_ĐHCQ","Ngành Công nghệ vật liệu_ĐHCQ","Ngành Kỹ thuật hóa học_ThS"]
["Khoa Công nghệ May và Thời trang","V",null,"Ngành Công nghệ  dệt, may_ĐHCQ"]
["Khoa Công nghệ Sinh học","IV",null,"Ngành Công nghệ Sinh học_ĐHCQ","Ngành Công nghệ sinh học_ThS"]
["Khoa Công nghệ Thông tin","V",null,"Ngành Công nghệ thông tin_ĐHCQ","Ngành An toàn thông tin_ĐHCQ"]
["Khoa Công nghệ Thực phẩm","V",null,"Ngành Công nghệ thực phẩm_ĐHCQ","Ngành Đảm bảo chất lượng và an toàn thực phẩm_ĐHCQ","Ngành Công nghệ Thực phẩm_ThS"]
["Khoa Du lịch và Ẩm thực","VI","VII","Ngành Khoa học chế biến món ăn_ĐHCQ","Ngành Khoa học dinh dưỡng và Ẩm thực_ĐHCQ","Ngành Quản trị dịch vụ du lịch và lữ hành_ĐHCQ","Ngành Quản trị nhà hàng và dịch vụ ăn uống_ĐHCQ"]
["Khoa Môi trường - Tài nguyên và biến đổi khí hậu","V","VII","Ngành Công nghệ kỹ thuật môi trường_ĐHCQ","Ngành Quản lý tài nguyên và môi trường_ĐHCQ","Ngành Kỹ thuật Môi trường_ThS"]
["Khoa Ngoại ngữ","VII",null,"Ngành Ngôn ngữ Anh_ĐHCQ"]
["Khoa Quản trị kinh doanh","III",null,"Ngành Quản trị kinh doanh_ĐHCQ","Ngành Kinh doanh quốc tế_ĐHCQ","Ngành Quản trị kinh doanh_ThS"]
["Khoa Tài chính Kế toán","III",null,"Ngành Kế toán-ĐHCQ","Ngành Tài chính ngân hàng_ĐHCQ","Ngành Tài chính ngân hàng_ThS"]
["Khoa Thủy sản","V",null,"Ngành Công nghệ chế biến thuỷ sản_ĐHCQ","Ngành Khoa học Thủy sản _ĐHCQ"]
[null,2,3,4,5,6,7]

{"sheet":"Khoi-Nganh","index":5,"n_rows":60,"n_cols":6,"rows_kept":60,"cut":false,"hidden":true,"merged":[]}
["Chọn khối ngành",null,"Chọn tên ngành"]
["III","Column13","Khối ngành","Mã ngành","Tên ngành","Đơn vị"]
["IV","Khoa Tài chính Kế toán","III",7340301,"Ngành Kế toán-ĐHCQ","Khoa Tài chính Kế toán"]
["V","Khoa Tài chính Kế toán","III",7340201,"Ngành Tài chính ngân hàng_ĐHCQ","Khoa Tài chính Kế toán"]
["VI","Khoa Quản trị kinh doanh","III",7340101,"Ngành Quản trị kinh doanh_ĐHCQ","Khoa Quản trị kinh doanh"]
["VII","Khoa Chính trị - Luật","III",7380107,"Ngành Luật kinh tế_ĐHCQ","Khoa Chính trị - Luật"]
[null,"Khoa Quản trị kinh doanh","III",7340120,"Ngành Kinh doanh quốc tế_ĐHCQ","Khoa Quản trị kinh doanh"]
[null,null,"III",null,"Trình độ ĐHLT"]
[null,"Khoa Tài chính Kế toán","III",null,"Ngành Kế toán_ĐHLT","Khoa Tài chính Kế toán"]
[null,"Khoa Tài chính Kế toán","III",null,"Ngành Tài chính - Ngân hàng_ĐHLT","Khoa Tài chính Kế toán"]
[null,"Khoa Quản trị kinh doanh","III",null,"Ngành Quản trị kinh doanh_ĐHLT","Khoa Quản trị kinh doanh"]
[null,null,"III",null,"Trình độ Thạc sỹ"]
[null,"Khoa Quản trị kinh doanh","III",null,"Ngành Quản trị kinh doanh_ThS","Khoa Quản trị kinh doanh"]
[null,"Khoa Tài chính Kế toán","III",null,"Ngành Tài chính ngân hàng_ThS","Khoa Tài chính Kế toán"]
[null,null,4,null,"Khối ngành IV"]
[null,null,"IV",null,"Trình độ ĐHCQ"]
[null,"Khoa Công nghệ Sinh học","IV",7420201,"Ngành Công nghệ Sinh học_ĐHCQ","Khoa Công nghệ Sinh học"]
[null,null,"IV",null,"Trình độ ĐHLT"]
[null,"Khoa Công nghệ Sinh học","IV",null,"Ngành Công nghệ sinh họcĐHLT","Khoa Công nghệ Sinh học"]
[null,null,"IV",null,"Trình độ Thạc sỹ"]
[null,"Khoa Công nghệ Sinh học","IV",null,"Ngành Công nghệ sinh học_ThS","Khoa Công nghệ Sinh học"]
[null,null,5,null,"Khối ngành V"]
[null,null,"V",null,"Trình độ ĐHCQ"]
[null,"Khoa Công nghệ Thông tin","V",7480201,"Ngành Công nghệ thông tin_ĐHCQ","Khoa Công nghệ Thông tin"]
[null,"Khoa CN Điện - Điện tử","V",7510301,"Ngành Công nghệ kỹ thuật điện - điện tử_ĐHCQ","Khoa Công nghệ Điện - Điện tử"]
[null,"Khoa Công nghệ Cơ khí","V",7510202,"Ngành Công nghệ chế tạo máy_ĐHCQ","Khoa Công nghệ Cơ khí"]
[null,"Khoa Công nghệ Cơ khí","V",7510203,"Ngành Công nghệ kỹ thuật cơ điện tử_ĐHCQ","Khoa Công nghệ Cơ khí"]
[null,"Khoa Công nghệ Hóa học","V",7510401,"Ngành Công nghệ kỹ thuật hoá học_ĐHCQ","Khoa Công nghệ Hóa học"]
[null,"Khoa Công nghệ Hóa học","V",7510402,"Ngành Công nghệ vật liệu_ĐHCQ","Khoa Công nghệ Hóa học"]
[null,"Khoa Công nghệ Thực phẩm","V",7540101,"Ngành Công nghệ thực phẩm_ĐHCQ","Khoa Công nghệ Thực phẩm"]
{"$rows_left_out":31}
{"sheet":"ListDLnhap","index":6,"n_rows":21,"n_cols":10,"rows_kept":21,"cut":false,"hidden":true,"merged":[]}
["Sheet B","Giới tính"]
["x","Nam"]
[null,"Nữ"]
[]
[]
[]
[]
[]
[]
[]
[null,null,null,null,null,null,null,null,null,{"$f":"ar","v":{"$error":"#NAME?"}}]
[]
[]
[]
[]
[null,null,null,null,null,"x","d","g","d"]
[null,null,null,null,null,"d","d","d","x"]
[]
[]
[null,null,null,null,null,{"$f":"COUNTIF($F$16:$K$16,\"x\")>1","v":false}]
[null,null,null,null,null,{"$f":"CONCATENATE($F16,$G16,$H16,$I16,$J16,$K16)","v":"xdgd"},{"$f":"F21=H21","v":false},"xc"]